{"text_format":"1","workbook":"xlsx","n_sheets":4,"sheets":["SF1","ACS","list_source","profile"],"not_rendered":{"charts":0,"images":0,"macros":0,"external_links":0,"defined_names":2,"comments":0,"pivot_tables":0},"unopened":[],"bounds":{"document_bytes":16777216,"sheet_cells":100000,"rows_first":2000,"rows_last":500,"rows_between":2000,"halvings":0,"cell_chars":16384,"cell_head_chars":4096},"cells_cut":0,"cells_raw":0,"read":"whole","date_system":"1900"}

{"sheet":"SF1","index":0,"n_rows":357,"n_cols":80,"rows_kept":357,"cut":false,"hidden":true,"merged":[[0,39,0,47],[0,49,0,51],[0,56,0,59],[0,60,0,63],[0,3,0,10],[0,11,0,18],[0,19,0,27],[0,29,0,37]]}
[null,null,null,"Non-Hispanic",null,null,null,null,null,null,null,"Hispanic",null,null,null,null,null,null,null,"Both Sexes",null,null,null,null,null,null,null,null,null,"Male",null,null,null,null,null,null,null,null,null,"Female",null,null,null,null,null,null,null,null,null,"Median Age",null,null,null,null,null,null,"  Institutionalized",null,null,null,"  Non-institutionalized"]
["TownID","TOWN","Total Population","Subtotal","White","Black / African American","American Indian / Alaska Native","Asian","Native Hawaiian / Pacific Islander","Some other race","Two or more races","Subtotal","White","Black / African American","  American Indian / Alaska Native","Asian","Native Hawaiian / Pacific Islander","Some other race","Two or more races","Total","Under 5 years","5 to 17 years","18 to 24 years","25 to 34 years","35 to 44 years","45 to 54 years","55 to 64 years","65 to 74 years","75 years and over","Total","Under 5 years","5 to 17 years","18 to 24 years","25 to 34 years","35 to 44 years","45 to 54 years","55 to 64 years","65 to 74 years","75 years and over","Total","Under 5 years","5 to 17 years","18 to 24 years","25 to 34 years","35 to 44 years","45 to 54 years","55 to 64 years","65 to 74 years","75 years and over","Both Sexes","Male","Female","Total households","Population in households","Average household size","Population in Group Quarters","Subtotal","Correctional institutions","Nursing homes","Other institutions","Subtotal","College dormitories","Military quarters","Other non-institutionalized","Total HH","1 Person HH","2 Person HH","3 Person HH","4 Person HH","5 Person HH","6 Person HH","7+ Person HH","Male Age 5+","Male Age 16+","Female Age 5+","Female Age 16+","Families","Occ. HU","Owner Occ. HU","Renter Occ. HU"]
[0,"dummy",0,0,0,0,0,0,0,0,0,0,0,0,0,0,0,0,0,0,0,0,0,0,0,0,0,0,0,0,0,0,0,0,0,0,0,0,0,0,0,0,0,0,0,0,0,0,0,0,0,0,0,0,0,0,0,0,0,0,0,0,0,0,0,0,0,0,0,0,0,0,0,0,0,0,0,0,0,0]
[1,"Abington",15985,15675,14617,313,41,282,2,226,194,310,171,29,6,2,0,77,25,15985,935,2747,1244,2081,2342,2707,2020,1086,823,7809,486,1431,638,1021,1160,1302,944,526,301,8176,449,1316,606,1060,1182,1405,1076,560,522,39.5,38,40.9,6080,15893,2.61,92,86,0,86,0,6,0,0,6,6080,1527,1889,1069,936,428,161,70,7323,6131,7727,6622,4111,6080,4254,1826]
[2,"Acton",21924,21364,16555,232,13,4062,3,159,340,560,398,6,5,5,0,104,42,21924,1140,5119,1085,1597,3295,4423,2854,1367,1044,10754,612,2618,578,769,1526,2192,1400,629,430,11170,528,2501,507,828,1769,2231,1454,738,614,41.9,41.2,42.5,8187,21788,2.66,136,111,0,111,0,25,0,0,25,8187,1886,2367,1493,1707,588,118,28,10142,7951,10642,8534,5958,8187,6223,1964]
[3,"Acushnet",10303,10184,9919,48,16,31,0,63,107,119,92,1,0,0,0,15,11,10303,465,1625,857,953,1484,1844,1443,874,758,5060,240,819,476,473,745,891,716,410,290,5243,225,806,381,480,739,953,727,464,468,43.6,42.4,44.9,3934,10293,2.62,10,0,0,0,0,10,0,0,10,3934,874,1283,758,679,239,63,38,4820,4133,5018,4367,2850,3934,3326,608]
[4,"Adams",8485,8387,8166,51,8,40,2,5,115,98,60,5,7,2,0,14,10,8485,387,1317,631,945,1043,1364,1204,737,857,4091,205,697,323,454,507,655,587,344,319,4394,182,620,308,491,536,709,617,393,538,44.3,42.6,46.1,3907,8466,2.17,19,0,0,0,0,19,0,0,19,3907,1366,1370,583,395,148,32,13,3886,3313,4212,3712,2289,3907,2390,1517]
[5,"Agawam",28438,27498,26287,383,29,496,0,25,278,940,612,43,16,6,0,187,76,28438,1326,4434,2074,2918,3715,4758,4062,2325,2826,13592,677,2262,1090,1438,1847,2309,1927,1041,1001,14846,649,2172,984,1480,1868,2449,2135,1284,1825,44.4,42.3,46.1,11664,27761,2.38,677,669,0,669,0,8,0,0,8,11664,3503,3931,1843,1556,541,180,110,12915,11045,14197,12387,7455,11664,8657,3007]
[6,"Alford",494,492,481,3,0,3,0,0,5,2,2,0,0,0,0,0,0,494,13,59,36,24,37,72,114,95,44,228,9,23,13,13,20,27,54,48,21,266,4,36,23,11,17,45,60,47,23,55.4,57,54.5,223,494,2.2200000000000002,0,0,0,0,0,0,0,0,0,223,62,97,33,17,13,1,0,219,199,262,234,146,223,203,20]
[7,"Amesbury",16283,15973,15479,108,30,106,6,38,206,310,209,12,7,0,1,54,27,16283,997,2648,1136,1848,2511,2957,2175,1010,1001,7871,514,1404,598,909,1202,1398,1039,459,348,8412,483,1244,538,939,1309,1559,1136,551,653,41.2,39.700000000000003,42.7,6642,15982,2.41,301,214,0,199,15,87,0,0,87,6642,1991,2112,1076,971,363,91,38,7357,6177,7929,6900,4162,6642,4539,2103]
[8,"Amherst",37819,35062,27717,1815,47,4109,11,146,1217,2757,1359,229,45,31,2,752,339,37819,839,2929,21115,3012,1997,2517,2615,1381,1414,18500,444,1492,10562,1600,920,1138,1200,620,524,19319,395,1437,10553,1412,1077,1379,1415,761,890,21.6,21.7,21.6,9259,22583,2.44,15236,123,0,118,5,15113,14952,0,161,9259,2530,3096,1678,1315,406,151,83,18056,16817,18924,17756,4484,9259,4258,5001]
[9,"Andover",33201,32005,27698,343,15,3415,8,73,453,1196,662,48,9,23,3,344,107,33201,1689,7065,2479,2309,4537,6297,4372,2299,2154,16021,867,3608,1310,1096,2087,3032,2172,1056,793,17180,822,3457,1169,1213,2450,3265,2200,1243,1361,42.1,41,43.1,11851,31798,2.68,1403,355,0,348,7,1048,845,0,203,11851,2645,3595,2074,2341,894,237,65,15154,12154,16358,13449,8817,11851,9448,2403]
[10,"Arlington",42844,41449,35804,981,29,3541,7,178,909,1395,913,59,20,9,1,239,154,42844,2843,6068,1904,5817,7134,6836,5481,3128,3633,19904,1402,3020,960,2728,3416,3230,2515,1320,1313,22940,1441,3048,944,3089,3718,3606,2966,1808,2320,41.7,40.4,43,18969,42553,2.2400000000000002,291,201,2,102,97,90,0,0,90,18969,6463,6138,2971,2479,689,167,62,18502,15920,21499,18881,10981,18969,11620,7349]
[11,"Ashburnham",6081,5926,5713,53,6,71,2,2,79,155,96,6,2,0,0,36,15,6081,311,1233,507,509,887,1176,863,358,237,3089,175,632,276,250,417,595,459,173,112,2992,136,601,231,259,470,581,404,185,125,40.799999999999997,40.6,41.1,2148,5914,2.75,167,0,0,0,0,167,60,0,107,2148,362,743,411,403,167,52,10,2914,2423,2856,2359,1661,2148,1928,220]
[12,"Ashby",3074,3017,2954,9,2,10,1,2,39,57,32,3,3,0,0,9,10,3074,151,602,208,258,440,641,451,186,137,1545,71,302,106,130,215,327,237,102,55,1529,80,300,102,128,225,314,214,84,82,42.6,43.1,42.2,1105,3074,2.78,0,0,0,0,0,0,0,0,0,1105,171,401,202,204,92,28,7,1474,1226,1449,1213,862,1105,1014,91]
[13,"Ashfield",1737,1706,1650,6,8,9,0,1,32,31,25,1,1,0,0,0,4,1737,64,267,91,129,218,307,402,150,109,853,42,137,44,69,109,140,190,77,45,884,22,130,47,60,109,167,212,73,64,48.9,47.2,50.3,760,1735,2.2799999999999998,2,0,0,0,0,2,0,0,2,760,206,327,91,92,34,8,2,811,692,862,751,477,760,615,145]
[14,"Ashland",16593,15853,13530,369,16,1450,0,236,252,740,448,22,7,2,3,201,57,16593,1186,2951,918,1924,2710,2939,2159,1015,791,8066,607,1489,483,928,1328,1427,1032,456,316,8527,579,1462,435,996,1382,1512,1127,559,475,40.1,39.200000000000003,41,6385,16548,2.59,45,39,0,24,15,6,0,0,6,6385,1464,2052,1223,1122,380,104,40,7459,6189,7948,6699,4531,6385,5210,1175]
[15,"Athol",11584,11171,10804,95,17,83,0,15,157,413,236,18,12,1,0,99,47,11584,646,2004,995,1329,1525,1876,1446,836,927,5696,334,1044,540,651,765,899,721,401,341,5888,312,960,455,678,760,977,725,435,586,40.6,39,42.2,4656,11457,2.46,127,122,0,122,0,5,0,0,5,4656,1323,1531,785,591,271,110,45,5362,4501,5576,4766,2989,4656,3315,1341]
[16,"Attleboro",43593,40828,36608,1247,64,1973,27,169,740,2765,1367,52,34,5,12,1065,230,43593,2802,7109,3447,5615,6799,7178,5034,2829,2780,21294,1408,3628,1734,2764,3434,3561,2466,1268,1031,22299,1394,3481,1713,2851,3365,3617,2568,1561,1749,39.5,38.6,40.299999999999997,16884,43029,2.5499999999999998,564,451,0,429,22,113,0,0,113,16884,4461,5249,3008,2578,1075,335,178,19886,16831,20905,18001,11212,16884,11208,5676]
[17,"Auburn",16188,15762,15082,154,21,299,3,20,183,426,284,24,2,0,0,76,40,16188,791,2607,1077,1684,2277,2603,2192,1366,1591,7806,414,1323,570,801,1131,1247,1047,625,648,8382,377,1284,507,883,1146,1356,1145,741,943,43.7,42.3,45,6542,16039,2.4500000000000002,149,135,0,135,0,14,0,0,14,6542,1822,2179,1058,960,361,120,42,7392,6309,8005,6924,4345,6542,5406,1136]
{"$rows_left_out":338}
{"sheet":"ACS","index":1,"n_rows":359,"n_cols":85,"rows_kept":359,"cut":false,"hidden":true,"merged":[[1,26,1,40],[2,2,2,7],[2,9,2,24],[2,27,2,33],[2,34,2,40]]}
["TownID","TOWN",null,null,null,null,null,null,null,null,null,null,null,null,null,null,null,null,null,null,null,null,null,null,null,null,null,null,null,null,null,null,null,null,null,null,null,null,null,null,null,null,null,null,null,null,null,null,null,null,null,null,null,null,null,null,null,null,null,null,null,null,null,null,null,null,null,null,null,null,null,null,null,null,null,null,null,null,"Income"]
[null,null,null,null,null,null,null,null,null,null,null,null,null,null,null,null,null,null,null,null,null,null,null,null,null,null,"Population aged 16 and over"]
[null,null,"Population Aged 5 years and over",null,null,null,null,null,null,"Workers aged 16 and over",null,null,null,null,null,null,null,null,null,null,null,null,null,null,null,null,null,"Male",null,null,null,null,null,null,"Female",null,null,null,null,null,null,null,"Occupied housing units",null,null,null,null,null,null,null,null,null,null,null,null,null,null,null,null,null,null,null,null,null,"Travel time to work"]
["TownID","TOWN","Total","Speak only English","Speak some other language","Speak English \"very well\"","Speak English \"well\"","Speak English \"not well\"","Speak English \"not at all\"","Total","Car, truck or van","Drove alone","Carpooled","Public transportation","Bus or trolley bus","Streetcar or trolley car","Subway or elevated","Railroad","Ferryboat","Taxicab","Motorcycle","Bicycle","  Walked","Other means","  Worked at home","Mean Travel Time to Work","Total","Subtotal","In labor force","In armed forces","      Civilian - total","      Civilian - employed","Civilian - unemployed","Not in labor force","Subtotal","In labor force","In armed forces","      Civilian - total","      Civilian - employed","Civilian - unemployed","Not in labor force","Median household income in 1999","Total","No vehicle available","1 vehicle available","2 vehicles available","3 vehicles available","4 vehicles available","5 or more vehicles available","Aggregate Vehicles","Average vehicles per occupied housing unit","Total Households","Under $10,000","$10,000 to $19,999","$20,000 to $29,999","$30,000 to $39,999","$40,000 to $49,999","$50,000 to $59,999","$60,000 to $74,999","$75,000 to $99,999","$100,000 to $124,999","$125,000 to $149,999","$150,000 to $199,999","$200,000 and up","Total Workers","Less than 5 minutes","5 to 9 minutes","10 to 14 minutes","15 to 19 minutes","20 to 24 minutes","25 to 29 minutes","30 to 34 minutes","35 to 39 minutes","40 to 44 minutes","45 to 59 minutes","60 to 89 minutes","90 minutes and up","Median travel time","Total Population","Total HH","Pop in HH","Aggregate HH Income","Average HH Income","Aggregate Income","Per Capita Income"]
[0,"dummy",0,0,0,0,0,0,0,0,0,0,0,0,0,0,0,0,0,0,0,0,0,0,0,0,0,0,0,0,0,0,0,0,0,0,0,0,0,0,0,0,0,0,0,0,0,0,0,0,0,0,0,0,0,0,0,0,0,0,0,0,0,0,0,0,0,0,0,0,0,0,0,0,0,0,0,0,0,0,0,0,0,0,0]
[1,"Abington",15333,14296,1037,618,293,103,23,8782,7627,6825,802,831,30,27,210,555,9,0,0,12,82,62,168,31.4,13261,5928,4575,10,4565,4147,418,1353,7333,5078,0,5078,4762,316,2255,80148,6035,221,2090,2695,733,229,67,10968,1.82,6035,150,369,314,379,473,601,476,1140,790,422,586,335,8614,215,641,700,1256,1164,538,1057,320,367,996,940,420,28.076208178438659,16112,6035,16022,565561600,93714,581175952,36071]
[2,"Acton",21916,15945,5971,4500,963,294,214,11892,10150,9510,640,678,43,0,115,520,0,0,0,14,205,51,794,35.799999999999997,17894,8927,7013,16,6997,6629,368,1914,8967,5701,0,5701,5436,265,3266,125635,8720,322,2120,4617,1465,172,24,16557,1.9,8720,330,419,305,291,358,339,527,942,817,948,1406,2038,11098,188,753,993,910,1036,592,1329,635,1143,1544,1504,471,34.051918735891647,22925,8720,22779,1305562200,149720,1313212775,57283]
[3,"Acushnet",10014,7826,2188,1479,454,255,0,5405,5159,4907,252,0,0,0,0,0,0,8,0,7,22,24,185,25.5,8776,4452,3404,0,3404,3057,347,1048,4324,2671,0,2671,2514,157,1653,67421,3907,202,965,1772,487,352,129,8108,2.08,3907,105,408,296,241,254,383,411,576,429,407,327,70,5220,214,426,766,930,1237,126,474,126,70,385,293,173,21.10751818916734,10374,3907,10360,318921400,81628,328171116,31634]
[4,"Adams",7947,7499,448,364,47,27,10,4168,3786,3414,372,28,28,0,0,0,0,0,0,13,126,4,211,20.399999999999999,6937,3247,2203,0,2203,2004,199,1044,3690,2350,0,2350,2201,149,1340,45893,3806,361,1614,1471,242,74,44,5805,1.53,3806,182,589,416,451,461,223,409,578,252,105,87,53,3957,356,643,564,588,515,250,642,41,64,97,114,83,18.533163265306122,8319,3806,8294,223922000,58834,225444900,27100]
[5,"Agawam",27310,23716,3594,2446,733,339,76,14401,13648,12584,1064,80,57,0,0,23,0,0,17,0,146,148,362,21.8,23668,10949,8112,16,8096,7619,477,2837,12719,7558,0,7558,7104,454,5161,61494,11488,733,4050,4630,1433,484,158,20360,1.77,11488,536,1245,1001,951,855,1000,1131,1506,1254,919,742,348,14039,519,1337,1870,3084,2793,1030,1753,282,230,619,266,256,20.375044754744003,28688,11488,28075,856685500,74572,880692912,30699]
[6,"Alford",469,459,10,10,0,0,0,259,202,182,20,18,3,0,13,2,0,0,0,0,10,4,25,28,417,201,152,0,152,147,5,49,216,114,0,114,114,0,102,95313,202,5,52,101,26,16,2,406,2.0099999999999998,202,2,17,10,19,21,15,8,24,19,12,20,35,234,4,27,34,63,36,11,21,3,12,7,2,14,19.126984126984127,484,202,484,27531000,136292,28098136,58054]
[7,"Amesbury",16104,15351,753,540,85,56,72,9373,7923,6939,984,252,203,0,0,49,0,8,25,52,250,114,749,30.7,14054,6790,5000,0,5000,4670,330,1790,7264,5142,0,5142,4888,254,2122,76558,7055,535,2352,3308,683,94,83,11808,1.67,7055,246,423,463,544,525,334,909,1162,764,514,785,386,8624,362,850,932,1245,768,430,989,376,532,924,838,378,26.802325581395351,16907,7055,16590,659560600,93488,668485873,39539]
[8,"Amherst",38608,32330,6278,4630,1253,279,116,17790,9399,8268,1131,1727,1645,0,54,28,0,13,28,434,3842,45,2302,18.100000000000001,36594,17797,9827,0,9827,8639,1188,7970,18797,10950,0,10950,9937,1013,7847,48059,8938,1058,3287,3048,991,428,126,14727,1.65,8938,1214,1087,983,802,508,461,574,1011,627,547,439,685,15488,813,3176,4072,2524,1512,518,1017,171,365,644,421,255,14.610756385068761,39482,8938,23223,672921700,75288,746407210,18905]
[9,"Andover",32732,26484,6248,4337,1395,277,239,16799,14147,13381,766,786,179,0,83,524,0,10,0,48,525,119,1164,31,27003,12976,9521,14,9507,8948,559,3455,14027,8527,0,8527,8135,392,5500,129082,12174,558,3140,5889,2094,344,149,23393,1.92,12174,478,451,407,591,516,539,795,1144,937,1101,2047,3168,15635,439,1686,1908,2200,1696,686,1759,333,762,1717,1714,735,24.67128537735849,34616,12174,33146,1934079800,158870,1974773568,57048]
[10,"Arlington",41006,32636,8370,5961,1432,749,228,24084,17015,15523,1492,4310,1505,107,2517,181,0,13,0,803,505,85,1353,30.9,35857,16434,12550,24,12526,11923,603,3884,19423,13102,9,13093,12513,580,6321,93787,18643,1997,7882,7440,1064,187,73,27127,1.46,18643,775,1095,1226,959,857,918,1541,2433,1762,1737,2135,3205,22731,262,730,2027,2539,3042,1915,3816,990,1740,3578,1783,309,31.11438679245283,44128,18643,43814,2237334600,120009,2276078112,51579]
[11,"Ashburnham",6005,5857,148,148,0,0,0,3220,2937,2697,240,40,0,0,0,40,0,0,0,0,74,0,169,35.299999999999997,4870,2335,1756,0,1756,1697,59,579,2535,1850,0,1850,1683,167,685,87615,2216,46,635,981,445,65,44,4431,2,2216,128,86,70,93,131,183,172,425,347,158,189,234,3051,64,125,277,402,489,243,321,45,56,400,371,258,28.467078189300409,6160,2216,5950,225425400,101726,230809040,37469]
[12,"Ashby",3077,2884,193,160,7,17,9,1674,1539,1497,42,14,0,0,0,14,0,0,0,0,22,5,94,33.1,2692,1348,998,8,990,905,85,350,1344,838,0,838,791,47,506,82019,1048,24,187,481,230,80,46,2415,2.2999999999999998,1048,18,35,75,82,72,44,138,178,165,123,88,30,1580,65,48,140,170,312,95,202,37,96,150,154,111,27.894736842105264,3177,1048,3177,93493300,89211,94925583,29879]
[13,"Ashfield",1524,1455,69,59,4,3,3,984,876,815,61,4,4,0,0,0,0,0,6,0,21,6,71,33.799999999999997,1382,666,539,3,536,522,14,127,716,494,0,494,478,16,222,71364,704,21,172,314,125,52,20,1491,2.12,704,15,53,33,67,80,53,65,134,103,44,15,42,913,39,72,53,51,84,49,159,78,53,127,132,16,33.411949685534587,1598,704,1595,59286400,84214,60553014,37893]
[14,"Ashland",15877,12488,3389,2589,312,410,78,9493,8400,7612,788,295,2,0,0,293,0,0,15,21,152,59,551,31.4,13508,6407,5169,20,5149,4957,192,1238,7101,4946,0,4946,4657,289,2155,102911,6596,149,1963,3306,859,264,55,12483,1.89,6596,145,293,420,282,383,277,588,830,752,502,896,1228,8942,94,580,787,1053,1498,476,1071,196,788,1405,736,258,29.821428571428577,17159,6596,17082,821644300,124567,830324010,48390]
[15,"Athol",11079,10657,422,335,75,6,6,5077,4698,4148,550,54,37,0,17,0,0,0,6,13,109,72,125,29.7,9473,4847,3290,32,3258,2790,468,1557,4626,2624,46,2578,2326,252,2002,47598,4761,520,1759,1734,541,178,29,7707,1.62,4761,317,720,489,486,430,445,418,536,608,222,56,34,4952,289,711,787,410,496,111,538,227,172,490,442,279,22.8125,11628,4761,11486,275152000,57793,281211552,24184]
{"$rows_left_out":340}
{"sheet":"list_source","index":2,"n_rows":355,"n_cols":2,"rows_kept":355,"cut":false,"hidden":true,"merged":[]}
["TOWN","TownID"]
["  click this cell and select a town",0]
[" Boston Region MPO total",997]
[" CTPS modeled region total",998]
[" Massachusetts total",999]
["Abington",1]
["Acton",2]
["Acushnet",3]
["Adams",4]
["Agawam",5]
["Alford",6]
["Amesbury",7]
["Amherst",8]
["Andover",9]
["Aquinnah",104]
["Arlington",10]
["Ashburnham",11]
["Ashby",12]
["Ashfield",13]
["Ashland",14]
{"$rows_left_out":336}
{"sheet":"profile","index":3,"n_rows":102,"n_cols":12,"rows_kept":102,"cut":false,"hidden":false,"merged":[[48,8,49,9],[101,2,111,11],[2,8,5,10]]}
[]
[]
[null,null,"Massachusetts",null,null,null,null,null,"Central Transportation Planning Staff\n10 Park Plaza\nSuite 2150\nBoston, MA 02116"]
[null,null,"2015 Demographic Profile"]
[]
[null,null,"City / Town:",null,1]
[null,null,"Town #",{"$f":"INDEX(list_source!B2:B355,E6)","v":0}]
[]
[]
[]
[null,null,"I. 100% Count Statistics - 2010 Census Summary File 1 (SF1)"]
[]
[null,null,"Population by Race and Hispanic Origin",null,"Total","Non-Hispanic","Hispanic",null,"Households by Size"]
[null,null,"White",null,{"$f":"F14+G14","v":0},{"$f":"VLOOKUP($D$7,'SF1'!$A$3:$BL$357,5,FALSE)","v":0},{"$f":"VLOOKUP($D$7,'SF1'!$A$3:$BL$357,13,FALSE)","v":0},null,"1 person households",null,{"$f":"VLOOKUP($D$7,'SF1'!$A$3:$BT$357,66,FALSE)","v":0}]
[null,null,"Black or African American ",null,0,{"$f":"VLOOKUP($D$7,'SF1'!$A$3:$BL$357,6,FALSE)","v":0},{"$f":"VLOOKUP($D$7,'SF1'!$A$3:$BL$357,14,FALSE)","v":0},null,"2 person households",null,{"$f":"VLOOKUP($D$7,'SF1'!$A$3:$BT$357,67,FALSE)","v":0}]
[null,null,"American Indian / Alaska Native",null,0,{"$f":"VLOOKUP($D$7,'SF1'!$A$3:$BL$357,7,FALSE)","v":0},{"$f":"VLOOKUP($D$7,'SF1'!$A$3:$BL$357,15,FALSE)","v":0},null,"3 person households",null,{"$f":"VLOOKUP($D$7,'SF1'!$A$3:$BT$357,68,FALSE)","v":0}]
[null,null,"Asian",null,0,{"$f":"VLOOKUP($D$7,'SF1'!$A$3:$BL$357,8,FALSE)","v":0},{"$f":"VLOOKUP($D$7,'SF1'!$A$3:$BL$357,16,FALSE)","v":0},null,"4 person households",null,{"$f":"VLOOKUP($D$7,'SF1'!$A$3:$BT$357,69,FALSE)","v":0}]
[null,null,"Native Hawaiian / Pacific Islander",null,0,{"$f":"VLOOKUP($D$7,'SF1'!$A$3:$BL$357,9,FALSE)","v":0},{"$f":"VLOOKUP($D$7,'SF1'!$A$3:$BL$357,17,FALSE)","v":0},null,"5 person households",null,{"$f":"VLOOKUP($D$7,'SF1'!$A$3:$BT$357,70,FALSE)","v":0}]
[null,null,"Some other race",null,0,{"$f":"VLOOKUP($D$7,'SF1'!$A$3:$BL$357,10,FALSE)","v":0},{"$f":"VLOOKUP($D$7,'SF1'!$A$3:$BL$357,18,FALSE)","v":0},null,"6 person households",null,{"$f":"VLOOKUP($D$7,'SF1'!$A$3:$BT$357,71,FALSE)","v":0}]
[null,null,"Two or more races",null,0,{"$f":"VLOOKUP($D$7,'SF1'!$A$3:$BL$357,11,FALSE)","v":0},{"$f":"VLOOKUP($D$7,'SF1'!$A$3:$BL$357,19,FALSE)","v":0},null,"7+ person households",null,{"$f":"VLOOKUP($D$7,'SF1'!$A$3:$BT$357,72,FALSE)","v":0}]
{"$rows_left_out":82}